{"text_format":"1","workbook":"xlsx","n_sheets":7,"sheets":["CSUF Deposit to Univ Account","CSUF PCD Reimb Form","Journal Upload Template","Account","CASHNet Item Codes","THEFD","S4000"],"not_rendered":{"charts":0,"images":13,"macros":1,"external_links":0,"defined_names":92,"comments":2,"pivot_tables":0},"unopened":[],"bounds":{"document_bytes":16777216,"sheet_cells":100000,"rows_first":2000,"rows_last":500,"rows_between":2000,"halvings":0,"cell_chars":16384,"cell_head_chars":4096},"cells_cut":0,"cells_raw":0,"read":"whole","date_system":"1900"}

{"sheet":"CSUF Deposit to Univ Account","index":0,"n_rows":36,"n_cols":22,"rows_kept":36,"cut":false,"hidden":false,"merged":[[0,0,0,20],[3,0,3,16],[3,17,3,19],[9,0,9,20],[10,2,10,6],[10,7,10,19],[1,0,2,20],[11,2,11,20],[12,0,12,20],[13,2,13,11],[13,13,13,16],[13,18,13,19],[4,0,4,20],[5,1,5,19],[6,0,6,20],[7,0,7,20],[8,0,8,2],[8,3,8,12],[8,13,8,14],[8,15,8,17],[8,19,8,20],[14,2,14,20],[15,0,15,7],[15,8,15,13],[15,14,15,20],[16,0,16,20],[17,0,17,4],[17,5,17,6],[17,8,17,9],[17,10,17,12],[17,13,17,15],[19,18,19,20],[20,0,20,20],[21,0,24,2],[21,3,21,14],[21,15,22,16],[21,17,22,17],[21,18,22,20],[17,16,17,20],[18,0,18,4],[18,5,18,12],[18,13,18,15],[18,16,18,17],[18,19,18,20],[22,5,22,6],[22,7,22,8],[22,11,22,12],[22,13,22,14],[23,5,23,8],[23,10,23,16],[19,0,19,4],[19,5,19,14],[19,15,19,17],[31,0,31,2],[31,3,31,5],[31,6,31,7],[31,8,31,10],[31,11,31,12],[31,14,31,16],[28,0,28,17],[29,0,30,2],[29,3,29,16],[29,17,30,17],[30,3,30,5],[30,6,30,7],[30,8,30,10],[30,11,30,12],[30,14,30,16],[33,6,33,7],[33,8,33,10],[33,11,33,12],[33,14,33,16],[32,0,32,2],[32,3,32,5],[32,6,32,7],[32,8,32,10],[32,11,32,12],[32,14,32,16],[35,0,35,13],[35,14,35,16],[36,0,36,3],[36,18,36,20],[37,0,37,3],[37,18,37,20],[34,0,34,2],[34,3,34,5],[34,6,34,7],[34,8,34,10],[34,11,34,12],[34,14,34,16],[23,18,35,20],[24,3,24,17],[25,0,25,17],[26,0,26,2],[26,3,26,8],[26,9,26,10],[26,11,26,12],[26,14,26,17],[27,0,27,2],[27,3,27,17],[33,0,33,2],[33,3,33,5],[41,0,41,3],[41,18,41,20],[42,0,42,3],[42,18,42,20],[43,0,43,3],[43,18,43,20],[38,0,38,3],[38,18,38,20],[39,0,39,3],[39,18,39,20],[40,0,40,3],[40,18,40,20],[47,0,47,3],[47,18,47,20],[48,0,48,3],[48,18,48,20],[49,0,49,3],[49,18,49,20],[44,0,44,3],[44,18,44,20],[45,0,45,3],[45,18,45,20],[46,0,46,3],[46,18,46,20],[53,0,53,3],[53,18,53,20],[54,0,54,3],[54,18,54,20],[55,0,55,3],[55,18,55,20],[50,0,50,3],[50,18,50,20],[51,0,51,3],[51,18,51,20],[52,0,52,3],[52,18,52,20],[59,0,59,3],[59,18,59,20],[60,0,60,3],[60,18,60,20],[61,0,61,3],[61,18,61,20],[56,0,56,3],[56,18,56,20],[57,0,57,3],[57,18,57,20],[58,0,58,3],[58,18,58,20],[65,0,65,3],[65,18,65,20],[66,0,66,3],[66,18,66,20],[67,0,67,3],[67,18,67,20],[62,0,62,3],[62,18,62,20],[63,0,63,3],[63,18,63,20],[64,0,64,3],[64,18,64,20],[71,0,71,3],[71,18,71,20],[72,0,72,3],[72,18,72,20],[73,0,73,3],[73,18,73,20],[68,0,68,3],[68,18,68,20],[69,0,69,3],[69,18,69,20],[70,0,70,3],[70,18,70,20],[77,0,77,3],[77,18,77,20],[78,0,78,3],[78,18,78,20],[79,0,79,3],[79,18,79,20],[74,0,74,3],[74,18,74,20],[75,0,75,3],[75,18,75,20],[76,0,76,3],[76,18,76,20],[83,0,83,3],[83,18,83,20],[84,0,84,3],[84,18,84,20],[85,0,85,3],[85,18,85,20],[80,0,80,3],[80,18,80,20],[81,0,81,3],[81,18,81,20],[82,0,82,3],[82,18,82,20],[89,0,89,3],[89,18,89,20],[90,0,90,3],[90,18,90,20],[91,0,91,3],[91,18,91,20],[86,0,86,3],[86,18,86,20],[87,0,87,3],[87,18,87,20],[88,0,88,3],[88,18,88,20],[95,0,95,3],[95,18,95,20],[96,0,96,3],[96,18,96,20],[97,0,97,3],[97,18,97,20],[92,0,92,3],[92,18,92,20],[93,0,93,3],[93,18,93,20],[94,0,94,3],[94,18,94,20],[101,0,101,3],[101,18,101,20],[102,0,102,3],[102,18,102,20],[103,0,103,3],[103,18,103,20],[98,0,98,3],[98,18,98,20],[99,0,99,3],[99,18,99,20],[100,0,100,3],[100,18,100,20],[107,0,107,3],[107,18,107,20],[108,0,108,3],[108,18,108,20],[109,0,109,3],[109,18,109,20],[104,0,104,3],[104,18,104,20],[105,0,105,3],[105,18,105,20],[106,0,106,3],[106,18,106,20],[113,0,113,3],[113,18,113,20],[114,0,114,3],[114,18,114,20],[115,0,115,3],[115,18,115,20],[110,0,110,3],[110,18,110,20],[111,0,111,3],[111,18,111,20],[112,0,112,3],[112,18,112,20],[119,0,119,3],[119,18,119,20],[120,0,120,3],[120,18,120,20],[121,0,121,3],[121,18,121,20],[116,0,116,3],[116,18,116,20],[117,0,117,3],[117,18,117,20],[118,0,118,3],[118,18,118,20],[125,0,125,3],[125,18,125,20],[126,0,126,3],[126,18,126,20],[127,0,127,3],[127,18,127,20],[122,0,122,3],[122,18,122,20],[123,0,123,3],[123,18,123,20],[124,0,124,3],[124,18,124,20],[131,0,131,3],[131,18,131,20],[132,0,132,3],[132,18,132,20],[133,0,133,3],[133,18,133,20],[128,0,128,3],[128,18,128,20],[129,0,129,3],[129,18,129,20],[130,0,130,3],[130,18,130,20],[137,0,137,3],[137,18,137,20],[138,0,138,3],[138,18,138,20],[139,0,139,3],[139,18,139,20],[134,0,134,3],[134,18,134,20],[135,0,135,3],[135,18,135,20],[136,0,136,3],[136,18,136,20],[143,0,143,3],[143,18,143,20],[144,0,144,3],[144,18,144,20],[145,0,145,3],[145,18,145,20],[140,0,140,3],[140,18,140,20],[141,0,141,3],[141,18,141,20],[142,0,142,3],[142,18,142,20],[149,0,149,3],[149,18,149,20],[150,0,150,3],[150,18,150,20],[151,0,151,3],[151,18,151,20],[146,0,146,3],[146,18,146,20],[147,0,147,3],[147,18,147,20],[148,0,148,3],[148,18,148,20],[155,0,155,3],[155,18,155,20],[156,0,156,3],[156,18,156,20],[157,0,157,3],[157,18,157,20],[152,0,152,3],[152,18,152,20],[153,0,153,3],[153,18,153,20],[154,0,154,3],[154,18,154,20],[164,0,164,3],[164,18,164,20],[161,0,161,3],[161,18,161,20],[162,0,162,3],[162,18,162,20],[163,0,163,3],[163,18,163,20],[158,0,158,3],[158,18,158,20],[159,0,159,3],[159,18,159,20],[160,0,160,3],[160,18,160,20]]}
[]
["Division of Administration & Finance  | Financial Services & Administrative Systems  | Accounting Services & Financial Reporting    "]
[]
["To: CSUF Cashier's Office (UH-180)"]
["Deposit Or Reimbursement To University Account"]
[null,"NOTE:  If you received a university invoice (ASRxxxxx) DO NOT use this form; take the invoice to the Cashier's Office with your payment."]
["The Deposit  to University Account form is submitted by departments to record revenue (non-student fees).  Attach any supporting documentation deemed relevant to the transaction.  \nTo request a new CASHNet Item Code, contact the Cashier's Office.  NOTE: Effective May 29, 2009, credit cards are no longer accepted as a form of payment at the Cashier's Office.\n"]
["   I.  Requester Information"]
["From Dept:",null,null,null,null,null,null,null,null,null,null,null,null,"Contact:",null,null,null,null,"Ext:"]
["   II.  Reason for Deposit or Reimbursement (To select ( √ ) Reason for Reimb or Deposit, click the yellow drop down option below and choose or type \"1\" )\n          a.  Travel Advance / Other"]
[null,null,"Other (Enter explanation here):"]
[null,null," Travel Advance (S5078 = 107001-DVPRF)"]
["        b.  Vendor Refund / PCD Reimbursement (click PCD Macro to go to the NEW form)"]
[null,null," Vendor refund (S4000/FUND)",null,null,null,null,null,null,null,null,null,"Invoice #:",null,null,null,null,"Purchase Order #: "]
[null,null," University reimbursement for personal expenditure charged to a PCD - Procurement Card (Click Macro to launch NEW form)"]
["     S5062 = 604001-FUND (Telephone Usage)\n     S5092 = 604802-FUND (Wireless Service)\n     S5055 = 660001-FUND (Postage and Freight)",null,null,null,null,null,null,null,"     S5080 = 606802-FUND (Travel-International)\n     S5081 = 606001-FUND (Travel-In State)\n     S5082 = 606002-FUND (Travel-Out of State)",null,null,null,null,null,"     S4000/FUND = any other 6xxxxx account (eg. 660003)\n          To post to the correct expense account, submit ETR; Charge 580093 / Credit 6xxxxx (original expense account); see ETR instructions below"]
["Instructions for Deposit Form: Complete to:  (a) automatically identify CASHNet Item Code to use in Section IV and (b) auto-fill Expenditure Transfer Request (ETR) form\nInstructions for ETR Form:  (a) To be used for CASHNet Item Codes S4000 only,  (b) click \"Create ETR\" macro button to go to the ETR worksheet; (c) validate ETR data, and (d) follow same procedures when submitting an ETR"]
["Enter chartfield to reimburse",null,null,null,null,"Account:",null,null,"Fund:",null,null,null,null,"For ETR: Cc... e-mail address(es):\n(separate by \" ; \" semi-colon)"]
["Cardholder Name:",null,null,null,null,null,null,null,null,null,null,null,null,"Use this CASHNet Item Code\n in Section IV below:",null,null,{"$f":"IFERROR(VLOOKUP($H$18,Account!$A:$B,2,0),\"S4000\")","v":"S4000"},null,"Statement Date:"]
["Vendor/Merchant Name:",null,null,null,null,null,null,null,null,null,null,null,null,null,null,"Original Charge:  (as shown on Statement)"]
{"$rows_left_out":17}
{"sheet":"CSUF PCD Reimb Form","index":1,"n_rows":30,"n_cols":19,"rows_kept":30,"cut":false,"hidden":false,"merged":[[0,0,0,20],[2,0,2,14],[2,15,2,20],[3,0,3,16],[3,17,3,19],[4,0,4,20],[5,0,5,20],[1,0,1,20],[6,0,6,20],[7,0,7,20],[8,0,8,2],[8,3,8,12],[8,13,8,14],[8,15,8,17],[8,19,8,20],[11,18,11,20],[12,0,12,20],[13,0,16,2],[13,3,13,14],[13,15,14,16],[13,17,14,17],[13,18,14,20],[9,0,9,20],[10,0,10,4],[10,5,10,12],[10,13,10,15],[10,16,10,17],[10,19,10,20],[14,5,14,6],[14,7,14,8],[14,11,14,12],[14,13,14,14],[15,5,15,8],[15,10,15,16],[11,0,11,4],[11,5,11,14],[11,15,11,17],[22,14,22,16],[23,0,23,2],[23,3,23,5],[23,6,23,7],[23,8,23,10],[23,11,23,12],[23,14,23,16],[20,0,20,17],[21,0,21,5],[21,6,21,10],[21,11,21,16],[21,17,22,17],[22,0,22,2],[22,3,22,5],[22,6,22,7],[22,8,22,10],[22,11,22,12],[25,0,25,2],[25,3,25,5],[25,6,25,7],[25,8,25,10],[25,11,25,12],[25,14,25,16],[24,0,24,2],[24,3,24,5],[24,6,24,7],[24,8,24,10],[24,11,24,12],[24,14,24,16],[27,6,27,7],[27,8,27,10],[27,11,27,12],[27,14,27,16],[26,0,26,2],[26,3,26,5],[26,6,26,7],[26,8,26,10],[26,11,26,12],[26,14,26,16],[29,0,29,13],[29,14,29,16],[30,0,30,3],[30,18,30,20],[31,0,31,3],[31,18,31,20],[28,0,28,2],[28,3,28,5],[28,6,28,7],[28,8,28,10],[28,11,28,12],[28,14,28,16],[15,18,29,20],[16,3,16,17],[17,0,17,17],[18,0,18,2],[18,3,18,8],[18,9,18,10],[18,11,18,12],[18,14,18,17],[19,0,19,2],[19,3,19,17],[27,0,27,2],[27,3,27,5],[35,0,35,3],[35,18,35,20],[36,0,36,3],[36,18,36,20],[37,0,37,3],[37,18,37,20],[32,0,32,3],[32,18,32,20],[33,0,33,3],[33,18,33,20],[34,0,34,3],[34,18,34,20],[41,0,41,3],[41,18,41,20],[42,0,42,3],[42,18,42,20],[43,0,43,3],[43,18,43,20],[38,0,38,3],[38,18,38,20],[39,0,39,3],[39,18,39,20],[40,0,40,3],[40,18,40,20],[47,0,47,3],[47,18,47,20],[48,0,48,3],[48,18,48,20],[49,0,49,3],[49,18,49,20],[44,0,44,3],[44,18,44,20],[45,0,45,3],[45,18,45,20],[46,0,46,3],[46,18,46,20],[53,0,53,3],[53,18,53,20],[54,0,54,3],[54,18,54,20],[55,0,55,3],[55,18,55,20],[50,0,50,3],[50,18,50,20],[51,0,51,3],[51,18,51,20],[52,0,52,3],[52,18,52,20],[59,0,59,3],[59,18,59,20],[60,0,60,3],[60,18,60,20],[61,0,61,3],[61,18,61,20],[56,0,56,3],[56,18,56,20],[57,0,57,3],[57,18,57,20],[58,0,58,3],[58,18,58,20],[65,0,65,3],[65,18,65,20],[66,0,66,3],[66,18,66,20],[67,0,67,3],[67,18,67,20],[62,0,62,3],[62,18,62,20],[63,0,63,3],[63,18,63,20],[64,0,64,3],[64,18,64,20],[71,0,71,3],[71,18,71,20],[72,0,72,3],[72,18,72,20],[73,0,73,3],[73,18,73,20],[68,0,68,3],[68,18,68,20],[69,0,69,3],[69,18,69,20],[70,0,70,3],[70,18,70,20],[77,0,77,3],[77,18,77,20],[78,0,78,3],[78,18,78,20],[79,0,79,3],[79,18,79,20],[74,0,74,3],[74,18,74,20],[75,0,75,3],[75,18,75,20],[76,0,76,3],[76,18,76,20],[83,0,83,3],[83,18,83,20],[84,0,84,3],[84,18,84,20],[85,0,85,3],[85,18,85,20],[80,0,80,3],[80,18,80,20],[81,0,81,3],[81,18,81,20],[82,0,82,3],[82,18,82,20],[89,0,89,3],[89,18,89,20],[90,0,90,3],[90,18,90,20],[91,0,91,3],[91,18,91,20],[86,0,86,3],[86,18,86,20],[87,0,87,3],[87,18,87,20],[88,0,88,3],[88,18,88,20],[95,0,95,3],[95,18,95,20],[96,0,96,3],[96,18,96,20],[97,0,97,3],[97,18,97,20],[92,0,92,3],[92,18,92,20],[93,0,93,3],[93,18,93,20],[94,0,94,3],[94,18,94,20],[101,0,101,3],[101,18,101,20],[102,0,102,3],[102,18,102,20],[103,0,103,3],[103,18,103,20],[98,0,98,3],[98,18,98,20],[99,0,99,3],[99,18,99,20],[100,0,100,3],[100,18,100,20],[107,0,107,3],[107,18,107,20],[108,0,108,3],[108,18,108,20],[109,0,109,3],[109,18,109,20],[104,0,104,3],[104,18,104,20],[105,0,105,3],[105,18,105,20],[106,0,106,3],[106,18,106,20],[113,0,113,3],[113,18,113,20],[114,0,114,3],[114,18,114,20],[115,0,115,3],[115,18,115,20],[110,0,110,3],[110,18,110,20],[111,0,111,3],[111,18,111,20],[112,0,112,3],[112,18,112,20],[119,0,119,3],[119,18,119,20],[120,0,120,3],[120,18,120,20],[121,0,121,3],[121,18,121,20],[116,0,116,3],[116,18,116,20],[117,0,117,3],[117,18,117,20],[118,0,118,3],[118,18,118,20],[125,0,125,3],[125,18,125,20],[126,0,126,3],[126,18,126,20],[127,0,127,3],[127,18,127,20],[122,0,122,3],[122,18,122,20],[123,0,123,3],[123,18,123,20],[124,0,124,3],[124,18,124,20],[131,0,131,3],[131,18,131,20],[132,0,132,3],[132,18,132,20],[133,0,133,3],[133,18,133,20],[128,0,128,3],[128,18,128,20],[129,0,129,3],[129,18,129,20],[130,0,130,3],[130,18,130,20],[137,0,137,3],[137,18,137,20],[138,0,138,3],[138,18,138,20],[139,0,139,3],[139,18,139,20],[134,0,134,3],[134,18,134,20],[135,0,135,3],[135,18,135,20],[136,0,136,3],[136,18,136,20],[143,0,143,3],[143,18,143,20],[144,0,144,3],[144,18,144,20],[145,0,145,3],[145,18,145,20],[140,0,140,3],[140,18,140,20],[141,0,141,3],[141,18,141,20],[142,0,142,3],[142,18,142,20],[149,0,149,3],[149,18,149,20],[150,0,150,3],[150,18,150,20],[151,0,151,3],[151,18,151,20],[146,0,146,3],[146,18,146,20],[147,0,147,3],[147,18,147,20],[148,0,148,3],[148,18,148,20],[158,0,158,3],[158,18,158,20],[155,0,155,3],[155,18,155,20],[156,0,156,3],[156,18,156,20],[157,0,157,3],[157,18,157,20],[152,0,152,3],[152,18,152,20],[153,0,153,3],[153,18,153,20],[154,0,154,3],[154,18,154,20]]}
[]
["Division of Administration & Finance  | Financial Services & Administrative Systems  | Accounting Services & Financial Reporting        "]
[]
["To: CSUF Cashier's Office (UH-180)"]
["Deposit Or Reimbursement To University Account"]
["Procurement Card Reimbursement (PCD) Only"]
["Reimbursing the University for Disallowed Purchases: All disallowed expenditures must be reimbursed to the University within 30 days of purchase. \nINSTRUCTIONS: (1) Complete Deposit Or Reimbursement To University Account (Procurement Card Reimbursement (PCD) Only) and submit to CSUF Cashier's Office (UH-180); (2) Cashier's Office issues receipt; and (3) Attach receipt to the reconciled Procurement Card statement. If the statement has already been submitted, forward the receipt along with the cardholder information (name, statement month, Procurement Card number) to the Procurement Card Program in CP-300.\nIMPORTANT:  Remember to use account 660898 when reconciling P-card activity through Access Online or Concur for disallowed expenditures only.\nQuestions? Send an email to: ebusiness@fullerton.edu"]
["   I.  Requester Information"]
["From Dept:",null,null,null,null,null,null,null,null,null,null,null,null,"Contact:",null,null,null,null,"Ext:"]
["   II.  Reason for Deposit or Reimbursement (PCD Reimbursement)"]
["Cardholder Name:",null,null,null,null,null,null,null,null,null,null,null,null,"Travel Number:",null,null,null,null,"Statement Date:"]
["Vendor(s)/Merchant Name(s):",null,null,null,null,null,null,null,null,null,null,null,null,null,null,"Original Charge:  (as shown on Statement)",null,null,0]
["   III.  Deposit Information (To select ( √ ) Form of Payment, click the yellow drop down option below and choose or type \"1\" )"]
["Form of \nPayment:",null,null,null,null,null,null,null,null,null,null,null,null,null,null,"Total Deposit:",null,{"$f":"R16+N15+H15","v":0},"Cashier's Office use only:\n           Cashier's Endorsement"]
[null,null,null,null,null," Cash",null,0,null,null,null," Check",null,0]
[null,null,null,null,null," Other (please specify)",null,null,null,null,null,null,null,null,null,null,null,0,"Cashier's Office use only:\n           Cashier's Endorsement"]
[]
["        Check Information"]
["Check Number:",null,null,null,null,null,null,null,null,"Check Date:",null,null,null,"Received From:"]
["Check Memo / Desc:"]
{"$rows_left_out":11}
{"sheet":"Journal Upload Template","index":2,"n_rows":18,"n_cols":9,"rows_kept":18,"cut":false,"hidden":false,"merged":[[13,0,13,8],[3,0,3,8],[8,0,8,5],[5,0,5,8],[2,0,2,8],[7,0,7,2],[7,3,7,8],[6,0,6,1],[6,2,6,4],[11,6,11,7],[12,0,12,1],[12,5,12,8],[12,2,12,4],[11,0,11,5],[9,0,10,8],[8,6,8,7],[0,0,0,8],[1,0,1,8]]}
["Division of Administration & Finance  | Financial Services & Administrative Systems  | Accounting Services & Financial Reporting"]
["Expenditure Transfer Request (ETR)\nCSUF Journal Entry Upload Form"]
["INSTRUCTIONS: (1) Complete sections I to IV; (2) Click \"Data Validation\" macro; (3) OPTIONAL: Save a copy of the Excel file for your records; (4) Click \"E-mail\" macro to send form  via e-mail to DL-Accounting_Services; and (5) Send signed original form with back-up to CP-300 via inter-office mail (if applicable, attach OBIEE Actuals Detail report).\n"]
["* If billing an auxiliary organization (use of program code 7xxx), a purchase order (PO) is required.  To obtain a PO, please contact:\n     Auxiliary Services (CSUFASC) @ ext 4145               Philanthropic Foundation (CSFPF) @ ext 4420               Associated Students (ASI) @ ext 2406\nIMPORTANT: Please contact Budget Planning and Administration (Budget@fullerton.edu) for ALL salary related adjustments (accounts 601xxx, 602xxx or 603xxx)"]
["      Step 1                        ","                    Step 2 (click to run macro)",null,null,"Step 3",null,"     Step 4 (click to run macro)    Step 5                              (macro DISABLED)",null,"   (click to run macro)"]
[" I. Requestor Information"]
["     From Department: ",null,{"$f":"'CSUF Deposit to Univ Account'!$D$9","v":0},null,null,"Contact: ",{"$f":"'CSUF Deposit to Univ Account'!$P$9","v":0},"Ext:",{"$f":"'CSUF Deposit to Univ Account'!$T$9","v":0}]
["OPTIONAL: Cc... e-mail address(es)\n(separate by \" ; \" semi-colon)",null,null,0]
[" II. Reason for Request",null,null,null,null,null," V. Data Validation Completed? (No: email macro disabled)",null,1]
[{"$f":"\"Offset CASHNet deposit with reimbursement\"&\" ~ \"&'CSUF Deposit to Univ Account'!$O$27&\" ~ \"&'CSUF Deposit to Univ Account'!$D$28","v":"Offset CASHNet deposit with reimbursement ~  ~ "}]
[]
[" III. Authorizing Signature(s) (must be setup as a REQ approver)",null,null,null,null,null,"Reviewed By: (ASFR use only)"]
["     Print / Type Name:",null,null,null,null,"  Authorized Signer of Account(s)   ___________________________________________   Date ____________"]
[]
[" IV. Transfer Information",null,null,null,null,null,"Check / Total:",{"$f":"IF(ROUND(SUM(I17:I65001),2)=0,\"0.00\",\"Not balanced\")","v":"0.00"},{"$f":"SUM(I17:I65001)","v":0}]
["Account\n(6)","Fund Code\n(5)","Dept\n(5)","Program\n(4)","Class\n(5)","Project\n(8)","Line Description\n(Vendor name, Student name, etc.) (30)","Reference or Aux Org PO Nos. * (10)","Amount"]
[{"$f":"'CSUF Deposit to Univ Account'!$H$18","v":0},{"$f":"'CSUF Deposit to Univ Account'!$K$18","v":0},{"$f":"'CSUF Deposit to Univ Account'!$I$32","v":{"$error":"#N/A"}},{"$f":"IF('CSUF Deposit to Univ Account'!$L$32=\"OPTIONAL\",\"\",'CSUF Deposit to Univ Account'!$L$32)","v":{"$error":"#N/A"}},{"$f":"IF('CSUF Deposit to Univ Account'!$N$32=\"OPTIONAL\",\"\",'CSUF Deposit to Univ Account'!$N$32)","v":{"$error":"#N/A"}},{"$f":"IF('CSUF Deposit to Univ Account'!$O$32=\"OPTIONAL\",\"\",'CSUF Deposit to Univ Account'!$O$32)","v":{"$error":"#N/A"}},{"$f":"LEFT(\"CN Dep/Reimb~\"&'CSUF Deposit to Univ Account'!$D$28,30)","v":"CN Dep/Reimb~"},{"$f":"'CSUF Deposit to Univ Account'!$O$27","v":0},{"$f":"-'CSUF Deposit to Univ Account'!$R$32","v":0}]
[{"$f":"'CSUF Deposit to Univ Account'!$D$32","v":{"$error":"#N/A"}},{"$f":"'CSUF Deposit to Univ Account'!$G$32","v":{"$error":"#N/A"}},{"$f":"$C$17","v":{"$error":"#N/A"}},{"$f":"$D$17","v":{"$error":"#N/A"}},{"$f":"$E$17","v":{"$error":"#N/A"}},{"$f":"$F$17","v":{"$error":"#N/A"}},{"$f":"$G$17","v":"CN Dep/Reimb~"},{"$f":"$H$17","v":0},{"$f":"-$I$17","v":0}]

{"sheet":"Account","index":3,"n_rows":6,"n_cols":3,"rows_kept":6,"cut":false,"hidden":true,"merged":[]}
["604001","S5062","Telephone Usage"]
["660001","S5055","Postage and Freight"]
["606001","S5081","Travel-In State"]
["604802","S5092","Wireless Service"]
["606802","S5080","Travel-International"]
["606002","S5082","Travel-Out of State"]

{"sheet":"CASHNet Item Codes","index":4,"n_rows":123,"n_cols":11,"rows_kept":123,"cut":false,"hidden":false,"merged":[]}
["Item Code ","Description ","Account","Fund","Dept","Program","Class","Project","Comment",null,"LAST UPDATED: 10/15/2024"]
[]
["S4000","Miscellaneous","580093","required","required","optional","optional","optional"]
["DCIA","Housing Collected In Advance","205801","THOPR","n/a","n/a","n/a","n/a"]
["DCOMM","Housing Commission Revenue","504805","THOPR","10130","optional","optional","optional","added 10/3/2024"]
["DCONF","Dorm-Conference Deposit","504802","THOPR","10388","n/a","n/a","n/a"]
["DCRR","Deposit Conf Room Rental","504009","THOPR","10388","n/a","n/a","n/a"]
["DEPHRL","Housing and Residence Life Lic Agreement-Online","205801","THOPR","n/a","n/a","n/a","n/a"]
["DSUMMC","Summer Conferences - Misc","504002","THOPR","10388","n/a","n/a","n/a"]
["DSUMML","Summer Conferences - Meals","504010","THOPR","10388","n/a","n/a","n/a"]
["S080","Vendor Expo 2018","580093","THEXT","10064","n/a","n/a","n/a"]
["S1626","FTB - Library","501815","THEFD","10253","5295","n/a","n/a"]
["S1628","FTB - Misc","250812","required","not required","not required","not required","not required"]
["S2010","Global Titan Center Revenue","580090","TT034","10259","n/a","n/a","n/a"]
["S2150","CRED","501848","THEFD","10045","n/a","n/a","n/a"]
["S2155","Advising Teacher Ed Cred.","501846","THEFD","10045","n/a","n/a","n/a"]
["S2230","Chemistry Breakage Fee","501823","THEFD","10050","n/a","n/a","n/a"]
["S2250","Library Book Replacements","501815","THEFD","10253","5295","n/a","n/a"]
["S2255","Library Fines","501906","THEFD","90002","n/a","n/a","n/a"]
["S2350","Payroll-Accounts Receivable","250806","required","not required","not required","not required","not required"]
{"$rows_left_out":104}
{"sheet":"THEFD","index":5,"n_rows":1,"n_cols":1,"rows_kept":1,"cut":false,"hidden":true,"merged":[]}
["THEFD"]

{"sheet":"S4000","index":6,"n_rows":124,"n_cols":4,"rows_kept":124,"cut":false,"hidden":false,"merged":[]}
["S4000 - posts to account 580093 (Other Non-operating Revenues)"]
["Last Updated: 10/03/2024"]
[]
["Fund","Fund Desc","Comment","CSU Fund"]
["DONAI","Capital Asset Donations",null,"550"]
["DONAS","Auxiliary Projects - ASC / ASI",null,"550"]
["DONFD","Federally Funded Donations",null,"550"]
["DONPF","Auxiliary Projects-Foundation",null,"550"]
["FK001","TPL-Perkins Loans",null,"403"]
["SE001","TSE-St Educ Opp Grnt",null,"485"]
["SE002","TUG-State Univ Grant",null,"485"]
["SSFGF","Student Success Fee - GF",null,"485"]
["SW001","RMP SWAT",null,"485"]
["SW002","CSUPERB GRANTS",null,"485"]
["SW003","COAST GRANTS",null,"485"]
["SW004","Water Resr & Policy Initiative",null,"485"]
["SW006","Research,Scholarly&CreativeAct",null,"485"]
["SW007","Science/Tech/Engr/Math-NET",null,"485"]
["SW008","Asian Language Bilingual Teach",null,"485"]
["SW009","Center Healthy Neighborhoods",null,"485"]
{"$rows_left_out":104}